{"text_format":"1","workbook":"xlsx","n_sheets":6,"sheets":["Affordability Tool","Where Do I Find LCBP & SLCSP","Medicaid & CHIP Eligibility","Filing Threshold","138FPL","Applicable Figure"],"not_rendered":{"charts":0,"images":4,"macros":1,"external_links":0,"defined_names":0,"comments":0,"pivot_tables":0},"unopened":[],"bounds":{"document_bytes":16777216,"sheet_cells":100000,"rows_first":2000,"rows_last":500,"rows_between":2000,"halvings":0,"cell_chars":16384,"cell_head_chars":4096},"cells_cut":0,"cells_raw":0,"read":"whole","date_system":"1900"}

{"sheet":"Affordability Tool","index":0,"n_rows":64,"n_cols":6,"rows_kept":64,"cut":false,"hidden":false,"merged":[[56,4,61,5],[25,1,28,2],[49,1,49,2],[50,1,50,2],[39,1,39,5],[43,1,43,5],[44,1,44,5],[46,1,46,5],[48,1,48,2],[25,3,25,5],[48,4,53,5],[27,4,28,5],[27,3,28,3],[66,3,68,3],[40,1,40,5],[30,1,30,5],[47,1,47,5],[34,1,34,5],[54,1,54,2],[51,1,51,2],[52,1,52,2],[53,1,53,2],[55,1,55,2],[56,1,56,2],[57,1,57,2],[61,1,61,3],[37,1,37,4],[38,1,38,4],[62,1,62,5],[0,1,0,5],[2,1,2,2],[24,1,24,5],[15,1,15,2],[19,1,19,5],[17,1,17,2],[22,3,22,5],[3,4,6,4],[7,4,9,4],[2,4,2,5]]}
[null,"ACA Exemptions Related to Income"]
[null,"*All FPL levels are for the lower 48 states, not Alaska or Hawaii"]
[null,"Filing Status"]
[null,null,null,null,"Is the taxpayer or spouse age 65 or older?"]
[null,"Filing Status","Single",null,null,"No"]
[null,null,null,null,null,"You must answer this!"]
[null,"Total # of People in the Tax Household",1]
[null,null,null,null,"Dependent income (only if filing requirement)"]
[]
[null,null,null,"On the tax return"]
[null,"AGI","F1040 Line 37"]
[null,"Tax-exempt interest","F1040 Line 8b"]
[null,"Social Security Income","F1040 Line 20a"]
[null,"Taxable Social Security","F1040 line 20b"]
[null,"Foreign Income","F2555 Line 45 & 50"]
[null,"Pre-tax deduction for employer-sponsored coverage"]
[null,null,"Subtotal",{"$f":"SUM(D11+D12+D15)","v":0},{"$f":"SUM(E11+E12+E15)","v":0}]
[null,"Household Income (for Line 7 or Code A)",null,{"$f":"SUM(D17:E17)","v":0}]
[]
[null,"Test for Exemption for Income Below Filing Threshold (F8965, Line 7) "]
[null,"*Note: Also calculated in TaxSlayer. This tool does not consider gross income below filing threshold."]
[null,"Taxpayer's filing threshold is…",null,{"$f":"IF(AND(C5=\"Single\",F5=\"No\"),10350,IF(AND(C5=\"Single\",F5=\"One is 65 or older\"),11900,IF(AND(C5=\"MFJ\",F5=\"No\"),20700,IF(AND(C5=\"MFJ\",F5=\"One is 65 or older\"),21950,IF(AND(C5=\"MFJ\",F5=\"Both are 65 or older\"),23200,IF(AND(C5=\"HOH\",F5=\"No\"),13350,IF(AND(C5=\"HOH\",F5=\"One is 65 or older\"),14900,IF(AND(C5=\"QW\",F5=\"No\"),16650,IF(AND(C5=\"QW\",F5=\"One is 65 or older\"),17900,IF(C5=\"MFS\",4050))))))))))","v":10350}]
[null,"Is income below the filing threshold?  ",null,{"$f":"IF(D22>D18, \"YES the household is exempt\", \"NO exemption does not apply. CONTINUE\")","v":"YES the household is exempt"}]
[]
[null,"Test for Code G Exemption (Medicaid Coverage Gap)"]
[null,"Only use this exemption if, in 2016, the uninsured person lived in: Alabama, Florida, Georgia, Idaho, Kansas, Louisiana, Maine, Mississippi, Missouri, Nebraska, North Carolina, Oklahoma, South Carolina, South Dakota, Tennessee, Texas, Utah, Virginia, Wisconsin, or Wyoming",null,"Did an uninsured person live in a state that did not expand Medicaid?"]
[null,null,null,"Household income = ",{"$f":"SUM(D11+D12+D15+(D13-D14)+E11+E12+E15+(E13-E14))","v":0}]
[null,null,null,"Less than 138% FPL?",{"$f":"IF(VLOOKUP(C7,'138FPL'!A2:B8,2,FALSE)>E27, \"Yes, enter Code G if the person lived in an eligible state.\",\"No, Code G does not apply.\")","v":"Yes, enter Code G if the person lived in an eligible state."}]
[]
[]
[null,"Test for Code A Exemption (Affordability)"]
[]
[null,null,"8.13% of income = ",{"$f":"SUM($D$18+$D$16+$E$16)*0.0813","v":0}]
[]
[null,"(1) Does the taxpayer (or spouse) have an offer of self-only coverage from his or her own employer?                                        If yes, determine the offer's affordability and STOP."]
[null,null,"TP","SP","TP Annual Cost","SP Annual Cost"]
[null,"Self-only premium (per month)",null,null,{"$f":"SUM(C37*12)","v":0},{"$f":"SUM(D37*12)","v":0}]
[null,{"$f":"IF(ISBLANK(C37),\" \",IF(E37>D33,\"TP's cost of self-only coverage is unaffordable. Code A applies to TP.\",\"TP's cost of self-only coverage is affordable. Code A does NOT apply.\"))","v":" "}]
[null,{"$f":"IF(ISBLANK(D37),\" \",IF(F37>$D$33,\"Spouse's cost of self-only coverage is unaffordable. Code A applies to spouse.\",\"Spouse's cost of self-only coverage is affordable. Code A does NOT apply.\"))","v":" "}]
[null,"Note: If TP & SP (1) each had affordable employer offers and (2) had no affordable family offer and (3) the combined cost of the self-only offers is greater than 8.13% of income, claim Code G exemption for the entire year."]
[null,"(2) Does anyone have an offer of family coverage from an employer?  If yes, determine the offer's affordability and STOP."]
[null,null,"TP's Employer","SP's Employer","TP Annual Cost","SP Annual Cost"]
[null,"Family premium (per month)",null,null,{"$f":"SUM(C43*12)","v":0},{"$f":"SUM(D43*12)","v":0}]
[null,{"$f":"IF(ISBLANK(C43),\" \",IF(E43>D33,\"The TP's family coverage offer is unaffordable. Code A applies to everyone eligible for that coverage.\",\"Family coverage is affordable. Code A does NOT apply.\"))","v":" "}]
[null,{"$f":"IF(ISBLANK(D43),\" \",IF(F43>D33,\"The SP's family coverage offer is unaffordable. Code A applies to everyone eligible for that coverage.\",\"Family coverage is affordable. Code A does NOT apply.\"))","v":" "}]
[]
[null,"(3) If there is no employer offer, is the cost of marketplace coverage unaffordable? "]
[]
[null,"1. Monthly lowest cost bronze plan (LCBP)",null,null,"Who is included in Line 1? Look up the LCBP for each person in the household who is: (1) not offered employer coverage, and (2) not eligible for another exemption. Include people who are eligible for or enrolled in Medicare, Medicaid, CHIP and the marketplace. **Where do I look this up?  See tab \"Where Do I Find LCBP & SLCSP'**"]
[null,"2. Household income",null,{"$f":"D18","v":0}]
[null,"3. Nontaxable Social Security",null,{"$f":"SUM(D13-D14)","v":0}]
[null,"4. Add lines 2 + 3:",null,{"$f":"SUM(D50+D51)","v":0}]
[null,"5. Federal Poverty Line for family size",null,{"$f":"VLOOKUP(C7,'138FPL'!E2:F9,2,FALSE)","v":11770}]
[null,"6. Divide line 4 by line 5: (*Converted to FPL%*)",null,{"$f":"SUM(ROUNDDOWN(D52/D53,2))*100","v":0}]
[null,"7. Find applicable figure",null,{"$f":"VLOOKUP(D54,'Applicable Figure'!A2:B402,2,0)","v":2.0299999999999999E-2}]
[null,"8. Multiply line 4 by line 7:",null,{"$f":"D52*D55","v":0}]
[null,"9. Divide line 8 by 12:",null,{"$f":"D56/12","v":0},"Who is included in Line 10? Look up the SLCSP for each person in the household who is: (1) not eligible for any coverage (except marketplace) and (2) not eligible for another exemption. Ex: Single person eligible for Medicaid but not enrolled. Enter the LCBP in Line 1, enter zero on Line 10. **How do I know if someone may have been Medicaid-eligible? See tab \"Medicaid & CHIP Eligibility\"**"]
[null,"10. Monthly second lowest cost silver plan (SLCSP)"]
[null,"11. Subtract line 9 from line 10:",null,{"$f":"MAX(0,D58-D57)","v":0}]
[null,"12. Subtract line 11 from line 1:",null,{"$f":"MAX(0,D49-D59)","v":0}]
[null,"Annual cost of marketplace coverage:",null,{"$f":"D60*12","v":0}]
[null,{"$f":"IF(D61>D33,\"Marketplace coverage is unaffordable. Code A applies.\",\"Marketplace coverage is affordable. Code A does NOT apply.\")","v":"Marketplace coverage is affordable. Code A does NOT apply."}]
[null,"If there are midyear changes, you may need to complete this tool more than once for a tax household. For example, if someone was uninsured without an employer offer in January - June, then had an employer offer of coverage for the rest of the year, run this tool twice with the same annual income. For January - June, measure the affordability of marketplace coverage. For July - December, measure the affordability of the employer offer. "]
[null,null,null,null," "]

{"sheet":"Where Do I Find LCBP & SLCSP","index":1,"n_rows":21,"n_cols":4,"rows_kept":21,"cut":false,"hidden":false,"merged":[[3,0,3,3],[0,0,0,3],[5,1,5,2],[9,1,9,2],[15,1,15,2],[10,1,10,2],[1,1,1,2],[19,1,19,2],[17,1,17,2],[18,1,18,2],[7,1,7,2],[14,1,14,2]]}
["For States with Federally-Faciliated Marketplaces (i.e. states that use Healthcare.gov)"]
["Go to: ","www.healthcare.gov/tax-tool",null,"Select \"Claim an 'affordability' exemption\" and follow the instructions"]
[]
["For States with State-Based Marketplaces (all states listed below)"]
["State","LCBP Lookup Tool","SLCSP Lookup Tool","Tips"]
["California ","2016 plan compare tool not available at this time - see tips",null,"Covered California has not made 2016 plan cost information available online. Call the marketplace or use www.healthpocket.com for 2016 plan information."]
["Colorado","LCBP: tinyurl.com/ColLCBP   ","SLCSP: tinyurl.com/ColSLCSP","The LCBP tool only allows entry of one family member at a time. List everyone who should be included in line 1. The SLCSP allows the entry of multiple hosehold members. Only enter those who should be included in Line 10."]
["Connecticut","The LCBP and SLCSP tools have not been updated for 2016 (as of 2/24/2017) - see tips",null,"Health Access CT has not made 2016 plan cost information available online. Call the marketplace or use www.healthpocket.com for 2016 plan information. "]
["District of Columbia","LCBP: tinyurl.com/DC-Bronze ","SLCSP: tinyurl.com/DC-Silver","The LCBP is a pdf. Look up cost of plan for each family member. The SLCSP is a tax tool that asks enough questions to do an approximate Medicaid determination which eliminates the guesswork for tax preparers in understanding whether the taxpayer should have a value on Line 10. To calculate SLCSP in desired months, indicate that everyone who meets the definition for Line 10 were enrolled in a health plan in those months."]
["Hawaii","Use Healthcare.gov/tax-tool",null,"As of TY2016, Hawai'i no longer uses a state-based marketplace website for enrollment."]
["Idaho","General tax information: tinyurl.com/ID-tax-info (click on the Second Lowest Cost Silver Calculator)",null,"The SLCSP and LCBP calculator is a downloadable Excel tool. Run the tool twice if the people included in Line 1 and Line 10 are different."]
["Kentucky","LCBP: tinyurl.com/Ky-Bronze","SLCSP: tinyurl.com/Ky-Silver","Note that the instructions for the LCBP are misleading. Enter everyone who meets the definition for Line 1, including people in public coverage. Do not just enter people who are uninsured. To calculate SLCSP for desired months, indicate that everyone who meets the definition for Line 10 was enrolled in a health plan in those months."]
["Maryland","LCBP: tinyurl.com/MD-Bronze ","SLCSP: tinyurl.com/MD-Silver","Note that the instructions for the KCBP are incorrect. Enter everyone wh meets the definition for Line 1 (including people in puvlic coverage). Do not just enter people who are uninusred. To calculate SLCSP for desired months, indicate that everyone who meets the definition for Line 10 was enrolled in a health plan for those months. "]
["Massachusetts","LCBP: tinyurl.com/MassLCBP    "," SLCSP: tinyurl.com/MassSLCSP","To calculate SLCSP for desired months, indicate that everyone who meets the definition for Line 10 were enrolled in a health plan in those months. Remember to enter only the people who meet the definitions for inclusion in Lines 1 and 10."]
["Minnesota","Use Plan Compare tool: tinyurl.com/MN-PlanFinder",null,"This tax tool requires use of the plan compare tool. Remember that the people who are included in Line 1 and Line 10 of the Marketplace Affordability Worksheet may be different. You may need to run two searches of the plan selection tool. Sort plans from lowest to highest cost."]
["New Mexico","Use Healthcare.gov/tax-tool"]
["New York","LCBP: tinyurl.com/NY-Bronze  "," SLCSP: tinyurl.com/NY-Silver"]
["Nevada","Use Healthcare.gov/tax-tool"]
["Oregon","Use Healthcare.gov/tax-tool"]
["Rhode Island","LCBP and SLCSP premims vary by age: tinyurl.com/RI-Premiums",null,"Look up cost of plan for each family member "]
["Washington ","LCBP: tinyurl.com/WashLCBP","SLCSP: tinyurl.com/WashSLCSP"]

{"sheet":"Medicaid & CHIP Eligibility","index":2,"n_rows":0,"n_cols":0,"rows_kept":0,"cut":false,"hidden":false,"merged":[]}

{"sheet":"Filing Threshold","index":3,"n_rows":7,"n_cols":5,"rows_kept":7,"cut":false,"hidden":true,"merged":[]}
["Filing Threshold"]
[null,null,"Tax Payer Under 65","Tax Payer Older 65"]
["Single",null,10350,11900]
["MFJ",null,20700,23200,21950]
["MFS",null,4050]
["Head of Household",null,13350,14900]
["Widower w Depedent",null,16650,17900]

{"sheet":"138FPL","index":4,"n_rows":9,"n_cols":7,"rows_kept":9,"cut":false,"hidden":true,"merged":[]}
[null,"If Yes, Test Income Against 138% FPL ",null,null,null,"100% FPL","138% FPL"]
[1,16243,null,null,1,11770,{"$f":"SUM(F2*1.38)","v":16242.599999999999}]
[2,21983,null,null,2,15930,{"$f":"SUM(F3*1.38)","v":21983.399999999998}]
[3,27724,null,null,3,20090,27724.199999999997]
[4,33465,null,null,4,24250,33465]
[5,39206,null,null,5,28410,39205.799999999996]
[6,44947,null,null,6,32570,44946.6]
[7,50687,null,null,7,36730,50687.399999999994]
[8,56428,null,null,8,40890,56428.2]

{"sheet":"Applicable Figure","index":5,"n_rows":500,"n_cols":2,"rows_kept":500,"cut":false,"hidden":true,"merged":[]}
["FPL","Applicable Figure"]
[0,2.0299999999999999E-2]
[{"$f":"A2+1","v":1},2.0299999999999999E-2]
[{"$f":"A3+1","v":2},2.0299999999999999E-2]
[3,2.0299999999999999E-2]
[4,2.0299999999999999E-2]
[5,2.0299999999999999E-2]
[6,2.0299999999999999E-2]
[7,2.0299999999999999E-2]
[8,2.0299999999999999E-2]
[9,2.0299999999999999E-2]
[10,2.0299999999999999E-2]
[11,2.0299999999999999E-2]
[12,2.0299999999999999E-2]
[13,2.0299999999999999E-2]
[14,2.0299999999999999E-2]
[15,2.0299999999999999E-2]
[16,2.0299999999999999E-2]
[17,2.0299999999999999E-2]
[18,2.0299999999999999E-2]
[19,2.0299999999999999E-2]
[20,2.0299999999999999E-2]
[21,2.0299999999999999E-2]
[22,2.0299999999999999E-2]
[23,2.0299999999999999E-2]
[24,2.0299999999999999E-2]
[25,2.0299999999999999E-2]
[26,2.0299999999999999E-2]
[27,2.0299999999999999E-2]
[28,2.0299999999999999E-2]
[29,2.0299999999999999E-2]
[30,2.0299999999999999E-2]
[31,2.0299999999999999E-2]
[32,2.0299999999999999E-2]
[33,2.0299999999999999E-2]
[34,2.0299999999999999E-2]
[35,2.0299999999999999E-2]
[36,2.0299999999999999E-2]
[37,2.0299999999999999E-2]
[38,2.0299999999999999E-2]
[39,2.0299999999999999E-2]
[40,2.0299999999999999E-2]
[41,2.0299999999999999E-2]
[42,2.0299999999999999E-2]
[43,2.0299999999999999E-2]
[44,2.0299999999999999E-2]
[45,2.0299999999999999E-2]
[46,2.0299999999999999E-2]
[47,2.0299999999999999E-2]
[48,2.0299999999999999E-2]
[49,2.0299999999999999E-2]
[50,2.0299999999999999E-2]
[51,2.0299999999999999E-2]
[52,2.0299999999999999E-2]
[53,2.0299999999999999E-2]
[54,2.0299999999999999E-2]
[55,2.0299999999999999E-2]
[56,2.0299999999999999E-2]
[57,2.0299999999999999E-2]
[58,2.0299999999999999E-2]
[59,2.0299999999999999E-2]
[60,2.0299999999999999E-2]
[61,2.0299999999999999E-2]
[62,2.0299999999999999E-2]
[63,2.0299999999999999E-2]
[64,2.0299999999999999E-2]
[65,2.0299999999999999E-2]
[{"$f":"A67+1","v":66},2.0299999999999999E-2]
[67,2.0299999999999999E-2]
[68,2.0299999999999999E-2]
[69,2.0299999999999999E-2]
[70,2.0299999999999999E-2]
[71,2.0299999999999999E-2]
[72,2.0299999999999999E-2]
[73,2.0299999999999999E-2]
[74,2.0299999999999999E-2]
[75,2.0299999999999999E-2]
[76,2.0299999999999999E-2]
[77,2.0299999999999999E-2]
[78,2.0299999999999999E-2]
[79,2.0299999999999999E-2]
[80,2.0299999999999999E-2]
[81,2.0299999999999999E-2]
[82,2.0299999999999999E-2]
[83,2.0299999999999999E-2]
[84,2.0299999999999999E-2]
[85,2.0299999999999999E-2]
[86,2.0299999999999999E-2]
[87,2.0299999999999999E-2]
[88,2.0299999999999999E-2]
[89,2.0299999999999999E-2]
[90,2.0299999999999999E-2]
[91,2.0299999999999999E-2]
[92,2.0299999999999999E-2]
[93,2.0299999999999999E-2]
[94,2.0299999999999999E-2]
[95,2.0299999999999999E-2]
[96,2.0299999999999999E-2]
[97,2.0299999999999999E-2]
[98,2.0299999999999999E-2]
[99,2.0299999999999999E-2]
[100,2.0299999999999999E-2]
[101,2.0299999999999999E-2]
[102,2.0299999999999999E-2]
[103,2.0299999999999999E-2]
[104,2.0299999999999999E-2]
[105,2.0299999999999999E-2]
[106,2.0299999999999999E-2]
[107,2.0299999999999999E-2]
[108,2.0299999999999999E-2]
[109,2.0299999999999999E-2]
[110,2.0299999999999999E-2]
[111,2.0299999999999999E-2]
[112,2.0299999999999999E-2]
[113,2.0299999999999999E-2]
[114,2.0299999999999999E-2]
[115,2.0299999999999999E-2]
[116,2.0299999999999999E-2]
[117,2.0299999999999999E-2]
[118,2.0299999999999999E-2]
[119,2.0299999999999999E-2]
[120,2.0299999999999999E-2]
[121,2.0299999999999999E-2]
[122,2.0299999999999999E-2]
[123,2.0299999999999999E-2]
[124,2.0299999999999999E-2]
[125,2.0299999999999999E-2]
[126,2.0299999999999999E-2]
[127,2.0299999999999999E-2]
[128,2.0299999999999999E-2]
[129,2.0299999999999999E-2]
[{"$f":"A131+1","v":130},2.0299999999999999E-2]
[131,2.0299999999999999E-2]
[132,2.0299999999999999E-2]
[133,3.0499999999999999E-2]
[134,3.1099999999999999E-2]
[135,3.1699999999999999E-2]
[136,3.2300000000000002E-2]
[137,3.2899999999999999E-2]
[138,3.3500000000000002E-2]
[139,3.4099999999999998E-2]
[140,3.4700000000000002E-2]
[141,3.5299999999999998E-2]
[142,3.5900000000000001E-2]
[143,3.6499999999999998E-2]
[144,3.7100000000000001E-2]
[145,3.7699999999999997E-2]
[146,3.8300000000000001E-2]
[147,3.8899999999999997E-2]
[148,3.95E-2]
[149,4.0099999999999997E-2]
[150,4.07E-2]
[151,4.1200000000000001E-2]
[152,4.1599999999999998E-2]
[153,4.2099999999999999E-2]
[154,4.2599999999999999E-2]
[155,4.2999999999999997E-2]
[156,4.3499999999999997E-2]
[157,4.3999999999999997E-2]
[158,4.4400000000000002E-2]
[159,4.4900000000000002E-2]
[160,4.5400000000000003E-2]
[161,4.58E-2]
[162,4.6300000000000001E-2]
[163,4.6800000000000001E-2]
[164,4.7300000000000002E-2]
[165,4.7699999999999999E-2]
[166,4.82E-2]
[167,4.87E-2]
[168,4.9099999999999998E-2]
[169,4.9599999999999998E-2]
[170,5.0099999999999999E-2]
[171,5.0500000000000003E-2]
[172,5.0999999999999997E-2]
[173,5.1499999999999997E-2]
[174,5.1900000000000002E-2]
[175,5.2400000000000002E-2]
[176,5.2900000000000003E-2]
[177,5.33E-2]
[178,5.3800000000000001E-2]
[179,5.4300000000000001E-2]
[180,5.4699999999999999E-2]
[181,5.5199999999999999E-2]
[182,5.57E-2]
[183,5.6099999999999997E-2]
[184,5.6599999999999998E-2]
[185,5.7099999999999998E-2]
[186,5.7500000000000002E-2]
[187,5.8000000000000003E-2]
[188,5.8500000000000003E-2]
[189,5.8999999999999997E-2]
[190,5.9400000000000001E-2]
[191,5.9900000000000002E-2]
[192,6.0400000000000002E-2]
[193,6.08E-2]
[{"$f":"A195+1","v":194},6.13E-2]
[195,6.1800000000000001E-2]
[196,6.2199999999999998E-2]
[197,6.2700000000000006E-2]
[198,6.3200000000000006E-2]
[199,6.3600000000000004E-2]
[200,6.4100000000000004E-2]
[201,6.4500000000000002E-2]
[202,6.4799999999999996E-2]
[203,6.5199999999999994E-2]
[204,6.5500000000000003E-2]
[205,6.59E-2]
[206,6.6199999999999995E-2]
[207,6.6600000000000006E-2]
[208,6.6900000000000001E-2]
[209,6.7299999999999999E-2]
[210,6.7599999999999993E-2]
[211,6.8000000000000005E-2]
[212,6.83E-2]
[213,6.8699999999999997E-2]
[214,6.9099999999999995E-2]
[215,6.9400000000000003E-2]
[216,6.9800000000000001E-2]
[217,7.0099999999999996E-2]
[218,7.0499999999999993E-2]
[219,7.0800000000000002E-2]
[220,7.1199999999999999E-2]
[221,7.1499999999999994E-2]
[222,7.1900000000000006E-2]
[223,7.22E-2]
[224,7.2599999999999998E-2]
[225,7.2999999999999995E-2]
[226,7.3300000000000004E-2]
[227,7.3700000000000002E-2]
[228,7.3999999999999996E-2]
[229,7.4399999999999994E-2]
[230,7.4700000000000003E-2]
[231,7.51E-2]
[232,7.5399999999999995E-2]
[233,7.5800000000000006E-2]
[234,7.6100000000000001E-2]
[235,7.6499999999999999E-2]
[236,7.6799999999999993E-2]
[237,7.7200000000000005E-2]
[238,7.7600000000000002E-2]
[239,7.7899999999999997E-2]
[240,7.8299999999999995E-2]
[241,7.8600000000000003E-2]
[242,7.9000000000000001E-2]
[243,7.9299999999999995E-2]
[244,7.9699999999999993E-2]
[245,0.08]
[246,8.0399999999999999E-2]
[247,8.0699999999999994E-2]
[248,8.1100000000000005E-2]
[249,8.14E-2]
[250,8.1799999999999998E-2]
[251,8.2100000000000006E-2]
[252,8.2400000000000001E-2]
[253,8.2699999999999996E-2]
[254,8.3000000000000004E-2]
[255,8.3299999999999999E-2]
[256,8.3599999999999994E-2]
[257,8.3900000000000002E-2]
[{"$f":"A259+1","v":258},8.4199999999999997E-2]
[259,8.4500000000000006E-2]
[260,8.48E-2]
[261,8.5099999999999995E-2]
[262,8.5400000000000004E-2]
[263,8.5599999999999996E-2]
[264,8.5900000000000004E-2]
[265,8.6199999999999999E-2]
[266,8.6499999999999994E-2]
[267,8.6800000000000002E-2]
[268,8.7099999999999997E-2]
[269,8.7400000000000005E-2]
[270,8.77E-2]
[271,8.7999999999999995E-2]
[272,8.8300000000000003E-2]
[273,8.8599999999999998E-2]
[274,8.8900000000000007E-2]
[275,8.9200000000000002E-2]
[276,8.9499999999999996E-2]
[277,8.9800000000000005E-2]
[278,9.01E-2]
[279,9.0399999999999994E-2]
[280,9.0700000000000003E-2]
[281,9.0999999999999998E-2]
[282,9.1300000000000006E-2]
[283,9.1600000000000001E-2]
[284,9.1899999999999996E-2]
[285,9.2200000000000004E-2]
[286,9.2499999999999999E-2]
[287,9.2799999999999994E-2]
[288,9.2999999999999999E-2]
[289,9.3299999999999994E-2]
[290,9.3600000000000003E-2]
[291,9.3899999999999997E-2]
[292,9.4200000000000006E-2]
[293,9.4500000000000001E-2]
[294,9.4799999999999995E-2]
[295,9.5100000000000004E-2]
[296,9.5399999999999999E-2]
[297,9.5699999999999993E-2]
[298,9.6000000000000002E-2]
[299,9.6299999999999997E-2]
[300,9.6600000000000005E-2]
[301,9.6600000000000005E-2]
[302,9.6600000000000005E-2]
[303,9.6600000000000005E-2]
[304,9.6600000000000005E-2]
[305,9.6600000000000005E-2]
[306,9.6600000000000005E-2]
[307,9.6600000000000005E-2]
[308,9.6600000000000005E-2]
[309,9.6600000000000005E-2]
[310,9.6600000000000005E-2]
[311,9.6600000000000005E-2]
[312,9.6600000000000005E-2]
[313,9.6600000000000005E-2]
[314,9.6600000000000005E-2]
[315,9.6600000000000005E-2]
[316,9.6600000000000005E-2]
[317,9.6600000000000005E-2]
[318,9.6600000000000005E-2]
[319,9.6600000000000005E-2]
[320,9.6600000000000005E-2]
[321,9.6600000000000005E-2]
[{"$f":"A323+1","v":322},9.6600000000000005E-2]
[323,9.6600000000000005E-2]
[324,9.6600000000000005E-2]
[325,9.6600000000000005E-2]
[326,9.6600000000000005E-2]
[327,9.6600000000000005E-2]
[328,9.6600000000000005E-2]
[329,9.6600000000000005E-2]
[330,9.6600000000000005E-2]
[331,9.6600000000000005E-2]
[332,9.6600000000000005E-2]
[333,9.6600000000000005E-2]
[334,9.6600000000000005E-2]
[335,9.6600000000000005E-2]
[336,9.6600000000000005E-2]
[337,9.6600000000000005E-2]
[338,9.6600000000000005E-2]
[339,9.6600000000000005E-2]
[340,9.6600000000000005E-2]
[341,9.6600000000000005E-2]
[342,9.6600000000000005E-2]
[343,9.6600000000000005E-2]
[344,9.6600000000000005E-2]
[345,9.6600000000000005E-2]
[346,9.6600000000000005E-2]
[347,9.6600000000000005E-2]
[348,9.6600000000000005E-2]
[349,9.6600000000000005E-2]
[350,9.6600000000000005E-2]
[351,9.6600000000000005E-2]
[352,9.6600000000000005E-2]
[353,9.6600000000000005E-2]
[354,9.6600000000000005E-2]
[355,9.6600000000000005E-2]
[356,9.6600000000000005E-2]
[357,9.6600000000000005E-2]
[358,9.6600000000000005E-2]
[359,9.6600000000000005E-2]
[360,9.6600000000000005E-2]
[361,9.6600000000000005E-2]
[362,9.6600000000000005E-2]
[363,9.6600000000000005E-2]
[364,9.6600000000000005E-2]
[365,9.6600000000000005E-2]
[366,9.6600000000000005E-2]
[367,9.6600000000000005E-2]
[368,9.6600000000000005E-2]
[369,9.6600000000000005E-2]
[370,9.6600000000000005E-2]
[371,9.6600000000000005E-2]
[372,9.6600000000000005E-2]
[373,9.6600000000000005E-2]
[374,9.6600000000000005E-2]
[375,9.6600000000000005E-2]
[376,9.6600000000000005E-2]
[377,9.6600000000000005E-2]
[378,9.6600000000000005E-2]
[379,9.6600000000000005E-2]
[380,9.6600000000000005E-2]
[381,9.6600000000000005E-2]
[382,9.6600000000000005E-2]
[383,9.6600000000000005E-2]
[384,9.6600000000000005E-2]
[385,9.6600000000000005E-2]
[{"$f":"A387+1","v":386},9.6600000000000005E-2]
[387,9.6600000000000005E-2]
[388,9.6600000000000005E-2]
[389,9.6600000000000005E-2]
[390,9.6600000000000005E-2]
[391,9.6600000000000005E-2]
[392,9.6600000000000005E-2]
[393,9.6600000000000005E-2]
[394,9.6600000000000005E-2]
[395,9.6600000000000005E-2]
[396,9.6600000000000005E-2]
[397,9.6600000000000005E-2]
[398,9.6600000000000005E-2]
{"$rows_left_out":100}